I am trying to run the basic tutorial following the instruction at https://github.com/tensorflow/models/tree/master/syntaxnet
I am getting the following error when I do bazel test syntaxnet/... util/utf8/...
Following is the error snippet:
//syntaxnet:arc_standard_transitions_test PASSED in 0.0s
//syntaxnet:parser_features_test PASSED in 0.0s
//syntaxnet:sentence_features_test PASSED in 0.0s
//syntaxnet:shared_store_test PASSED in 0.2s
//syntaxnet:tagger_transitions_test PASSED in 0.0s
//util/utf8:unicodetext_unittest PASSED in 0.0s
//syntaxnet:beam_reader_ops_test FAILED in 0.1s
//syntaxnet:graph_builder_test FAILED in 0.1s
//syntaxnet:lexicon_builder_test FAILED in 0.1s
//syntaxnet:parser_trainer_test FAILED in 0.1s
//syntaxnet:reader_ops_test FAILED in 0.1s
//syntaxnet:text_formats_test FAILED in 0.1s
Executed 12 out of 12 tests: 6 tests pass and 6 fail locally. There were tests whose specified size is too big. Use the --test_verbose_timeout_warnings command line option to see which ones these are.
Is anybody familiar with this kind of error? Any help will be appreciated.
Thank you very much in advance.
If you are on Mac, test it by using this command instead: