I am installing the robocup simulator and followed these steps in this link installing robocup steps and this is what I find when I write the following command sudo make
in monitor directory
/usr/bin/ld: cannot find -laudio
/usr/bin/ld: cannot find -lXt
/usr/bin/ld: cannot find -lpng
/usr/bin/ld: cannot find -lgobject-2.0
/usr/bin/ld: cannot find -lSM
/usr/bin/ld: cannot find -lICE
/usr/bin/ld: cannot find -lXi
/usr/bin/ld: cannot find -lXrender
/usr/bin/ld: cannot find -lfreetype
/usr/bin/ld: cannot find -lfontconfig
collect2: ld returned 1 exit status
make[2]: *** [rcssmonitor] Error 1
make[2]: Leaving directory `/home/mostafa/Desktop/robocup simulator/rcssmonitor-15.1.0/src'
make[1]: *** [all-recursive] Error 1
make[1]: Leaving directory `/home/mostafa/Desktop/robocup simulator/rcssmonitor-15.1.0'
make: *** [all] Error 2
and this is the output when I write the same command sudo make
in base directory
loader.cpp: In static member function ‘static boost::filesystem3::path rcss::lib::Loader::stripDirName(const boost::filesystem3::path&)’:
loader.cpp:158:38: error: conversion from ‘boost::filesystem3::path’ to non-scalar type ‘std::string {aka std::basic_string<char>}’ requested
make[4]: *** [loader.lo] Error 1
make[4]: Leaving directory `/home/mostafa/Desktop/robocup simulator/rcssbase-12.1.3/rcssbase/lib'
make[3]: *** [all-recursive] Error 1
make[3]: Leaving directory `/home/mostafa/Desktop/robocup simulator/rcssbase-12.1.3/rcssbase/lib'
make[2]: *** [all-recursive] Error 1
make[2]: Leaving directory `/home/mostafa/Desktop/robocup simulator/rcssbase-12.1.3/rcssbase'
make[1]: *** [all-recursive] Error 1
make[1]: Leaving directory `/home/mostafa/Desktop/robocup simulator/rcssbase-12.1.3'
make: *** [all] Error 2
and this is what I get in server directory when calling the same command sudo make
/usr/bin/ld: cannot find -lrcssclangparser
collect2: ld returned 1 exit status
make[3]: *** [rcssserver] Error 1
make[3]: Leaving directory `/home/mostafa/Desktop/robocup simulator/rcssserver-15.2.2/src'
make[2]: *** [all] Error 2
make[2]: Leaving directory `/home/mostafa/Desktop/robocup simulator/rcssserver-15.2.2/src'
make[1]: *** [all-recursive] Error 1
make[1]: Leaving directory `/home/mostafa/Desktop/robocup simulator/rcssserver-15.2.2'
make: *** [all] Error 2
make is installed perfectly
try this
I know it's late :D I hope you didn't given up robocup ;)